�S���n�������c�̃R�[�h,ID,�n�������c�̖�,���T�[�r�X���Ə�����,���T�[�r�X���Ə�����_�J�i,���T�[�r�X���Ə�����_�p��,���{�T�[�r�X,���ݒn_�S���n�������c�̃R�[�h,����ID,���ݒn_�A���\�L,���ݒn_�s���{��,���ݒn_�s�撬��,���ݒn_����,���ݒn_�Ԓn�ȉ�,��������(����),�ܓx,�o�x,���x�̎��,���x�̒l,�d�b�ԍ�,�����ԍ�,FAX�ԍ�,�A���惁�[���A�h���X,�A����FormURL,�A������l�i���̑��ASNS�Ȃǁj,�X�֔ԍ�,�@�l�ԍ�,�@�l�̖���,���Ə��ԍ�,���p�\�j��,���p�\�j�����L����,���,URL,�摜,�摜_���C�Z���X,���l
062014,,�R�`���R�`�s,���V�l�ی��{�݃T�j�[�q������,,,�K�⃊�n�r���e�[�V����,,,�R�`���R�`�s��������̋u�V�Q�V�Ԓn�Q�O,,,,,,,,,,023-645-8500,,,,,,,,��ʍ��c�@�l�R�`�s���N������Î��ƒc,,,,,,,,
062014,,�R�`���R�`�s,���V�l�ی��{�݃T�j�[�q������,,,�ʏ����n�r���e�[�V����,,,�R�`���R�`�s��������̋u�V�Q�V�Ԓn�Q�O,,,,,,,,,,023-645-8500,,,,,,,,��ʍ��c�@�l�R�`�s���N������Î��ƒc,,,,30,,,,
062014,,�R�`���R�`�s,���V�l�ی��{�݃T�j�[�q������,,,�Z�������×{���,,,�R�`���R�`�s��������̋u�V�Q�V�Ԓn�Q�O,,,,,,,,,,023-645-8500,,,,,,,,��ʍ��c�@�l�R�`�s���N������Î��ƒc,,,,,,,,
062014,,�R�`���R�`�s,���V�l�ی��{�݃T�j�[�q������,,,���\�h�Z�������×{���,,,�R�`���R�`�s��������̋u�V�Q�V�Ԓn�Q�O,,,,,,,,,,023-645-8500,,,,,,,,��ʍ��c�@�l�R�`�s���N������Î��ƒc,,,,,,,,
062014,,�R�`���R�`�s,���V�l�ی��{�݃T�j�[�q������,,,���V�l�ی��{��,,,�R�`���R�`�s��������̋u�V�Q�V�Ԓn�Q�O,,,,,,,,,,023-645-8500,,,,,,,,��ʍ��c�@�l�R�`�s���N������Î��ƒc,,,,100,,,,
062014,,�R�`���R�`�s,���V�l�ی��{�݃T�j�[�q������,,,���\�h�K�⃊�n�r���e�[�V����,,,�R�`���R�`�s��������̋u�V�Q�V�Ԓn�Q�O,,,,,,,,,,023-645-8500,,,,,,,,��ʍ��c�@�l�R�`�s���N������Î��ƒc,,,,,,,,
062014,,�R�`���R�`�s,���V�l�ی��{�݃T�j�[�q������,,,���\�h�ʏ����n�r���e�[�V����,,,�R�`���R�`�s��������̋u�V�Q�V�Ԓn�Q�O,,,,,,,,,,023-645-8500,,,,,,,,��ʍ��c�@�l�R�`�s���N������Î��ƒc,,,,,,,,
062014,,�R�`���R�`�s,���V�l�ی��{�݂�����p���X,,,�K�⃊�n�r���e�[�V����,,,�R�`���R�`�s���c���S�|�R�|�Q�U,,,,,,,,,,023-628-3980,,,,,,,,��Ö@�l�Вc�I����,,,,,,,,
062014,,�R�`���R�`�s,���V�l�ی��{�݂�����p���X,,,�ʏ����n�r���e�[�V����,,,�R�`���R�`�s���c���S�|�R�|�Q�U,,,,,,,,,,023-628-3980,,,,,,,,��Ö@�l�Вc�I����,,,,116,,,,
062014,,�R�`���R�`�s,���V�l�ی��{�݂�����p���X,,,�Z�������×{���,,,�R�`���R�`�s���c���S�|�R�|�Q�U,,,,,,,,,,023-628-3980,,,,,,,,��Ö@�l�Вc�I����,,,,,,,,
062014,,�R�`���R�`�s,���V�l�ی��{�݂�����p���X,,,���\�h�Z�������×{���,,,�R�`���R�`�s���c���S�|�R�|�Q�U,,,,,,,,,,023-628-3980,,,,,,,,��Ö@�l�Вc�I����,,,,,,,,
062014,,�R�`���R�`�s,���V�l�ی��{�݂�����p���X,,,���V�l�ی��{��,,,�R�`���R�`�s���c���S�|�R�|�Q�U,,,,,,,,,,023-628-3980,,,,,,,,��Ö@�l�Вc�I����,,,,100,,,,
062014,,�R�`���R�`�s,���V�l�ی��{�݂�����p���X,,,���\�h�K�⃊�n�r���e�[�V����,,,�R�`���R�`�s���c���S�|�R�|�Q�U,,,,,,,,,,023-628-3980,,,,,,,,��Ö@�l�Вc�I����,,,,,,,,
062014,,�R�`���R�`�s,���V�l�ی��{�݂�����p���X,,,���\�h�ʏ����n�r���e�[�V����,,,�R�`���R�`�s���c���S�|�R�|�Q�U,,,,,,,,,,023-628-3980,,,,,,,,��Ö@�l�Вc�I����,,,,,,,,
062014,,�R�`���R�`�s,���V�l�ی��{�݃t���[����������,,,�Z�������×{���,,,�R�`���R�`�s�����V�X�Ԓn�̂P,,,,,,,,,,023-664-1556,,,,,,,,�Љ���@�l�������c�ϐ���x���R�`���ϐ���,,,,,,,,
062014,,�R�`���R�`�s,���V�l�ی��{�݃t���[����������,,,���\�h�Z�������×{���,,,�R�`���R�`�s�����V�X�Ԓn�̂P,,,,,,,,,,023-664-1556,,,,,,,,�Љ���@�l�������c�ϐ���x���R�`���ϐ���,,,,,,,,
062014,,�R�`���R�`�s,���V�l�ی��{�݃t���[����������,,,���V�l�ی��{��,,,�R�`���R�`�s�����V�X�Ԓn�̂P,,,,,,,,,,023-664-1556,,,,,,,,�Љ���@�l�������c�ϐ���x���R�`���ϐ���,,,,100,,,,
062014,,�R�`���R�`�s,���V�l�ی��{�݃T�j�[�q���R��,,,�ʏ����n�r���e�[�V����,,,�R�`���R�`�s�R���P�X�V�R�|�R�R�T,,,,,,,,,,023-667-5010,,,,,,,,��ʍ��c�@�l�R�`�s���N������Î��ƒc,,,,30,,,,
062014,,�R�`���R�`�s,���V�l�ی��{�݃T�j�[�q���R��,,,�Z�������×{���,,,�R�`���R�`�s�R���P�X�V�R�|�R�R�T,,,,,,,,,,023-667-5010,,,,,,,,��ʍ��c�@�l�R�`�s���N������Î��ƒc,,,,,,,,
062014,,�R�`���R�`�s,���V�l�ی��{�݃T�j�[�q���R��,,,���\�h�Z�������×{���,,,�R�`���R�`�s�R���P�X�V�R�|�R�R�T,,,,,,,,,,023-667-5010,,,,,,,,��ʍ��c�@�l�R�`�s���N������Î��ƒc,,,,,,,,
062014,,�R�`���R�`�s,���V�l�ی��{�݃T�j�[�q���R��,,,���V�l�ی��{��,,,�R�`���R�`�s�R���P�X�V�R�|�R�R�T,,,,,,,,,,023-667-5010,,,,,,,,��ʍ��c�@�l�R�`�s���N������Î��ƒc,,,,100,,,,
062014,,�R�`���R�`�s,���V�l�ی��{�݃T�j�[�q���R��,,,���\�h�ʏ����n�r���e�[�V����,,,�R�`���R�`�s�R���P�X�V�R�|�R�R�T,,,,,,,,,,023-667-5010,,,,,,,,��ʍ��c�@�l�R�`�s���N������Î��ƒc,,,,,,,,
062014,,�R�`���R�`�s,���×{�^�V�l�ی��{�ݖ؂̎�,,,�ʏ����n�r���e�[�V����,,,�R�`���R�`�s���U���꒚��7��23��,,,,,,,,,,023-679-5172,,,,,,,,�Љ��Ö@�l������,,,,60,,,,
062014,,�R�`���R�`�s,���×{�^�V�l�ی��{�ݖ؂̎�,,,���V�l�ی��{��,,,�R�`���R�`�s���U���꒚��7��23��,,,,,,,,,,023-679-5172,,,,,,,,�Љ��Ö@�l������,,,,29,,,,
062014,,�R�`���R�`�s,���×{�^�V�l�ی��{�ݖ؂̎�,,,���\�h�ʏ����n�r���e�[�V����,,,�R�`���R�`�s���U���꒚��7��23��,,,,,,,,,,023-679-5172,,,,,,,,�Љ��Ö@�l������,,,,,,,,
062014,,�R�`���R�`�s,�������K��T�[�r�X�Z���^�[�R�X���X,,,�K��Ō�,,,�R�`���R�`�s���U���꒚�ڂV�ԂQ�R��,,,,,,,,,,023-631-1674,,,,,,,,�Љ��Ö@�l������,,,,,,,,
062014,,�R�`���R�`�s,�������K��T�[�r�X�Z���^�[�R�X���X,,,���\�h�K��Ō�,,,�R�`���R�`�s���U���꒚�ڂV�ԂQ�R��,,,,,,,,,,023-631-1674,,,,,,,,�Љ��Ö@�l������,,,,,,,,
062014,,�R�`���R�`�s,�K��Ō�X�e�[�V������܂���,,,�K��Ō�,,,�R�`���R�`�s���h�꒚�ڂT�ԂU�R��,,,,,,,,,,023-685-8061,,,,,,,,���v�Вc�@�l�R�`���Ō싦��,,,,,,,,
062014,,�R�`���R�`�s,�K��Ō�X�e�[�V������܂���,,,���\�h�K��Ō�,,,�R�`���R�`�s���h�꒚�ڂT�ԂU�R��,,,,,,,,,,023-685-8061,,,,,,,,���v�Вc�@�l�R�`���Ō싦��,,,,,,,,
062014,,�R�`���R�`�s,�K��Ō�X�e�[�V�����ӂꂠ��,,,�K��Ō�,,,�R�`���R�`�s���c���l���ڂP�ԂP�S��,,,,,,,,,,023-628-3977,,,,,,,,��Ö@�l�Вc�I����,,,,,,,,
062014,,�R�`���R�`�s,�K��Ō�X�e�[�V�����ӂꂠ��,,,���\�h�K��Ō�,,,�R�`���R�`�s���c���l���ڂP�ԂP�S��,,,,,,,,,,023-628-3977,,,,,,,,��Ö@�l�Вc�I����,,,,,,,,
062014,,�R�`���R�`�s,�c�K��Ō�X�e�[�V����,,,�K��Ō�,,,�R�`���R�`�s�����Q�|�U�W,,,,,,,,,,023-623-1104,,,,,,,,��Ö@�l�c�D����,,,,,,,,
062014,,�R�`���R�`�s,�c�K��Ō�X�e�[�V����,,,���\�h�K��Ō�,,,�R�`���R�`�s�����Q�|�U�W,,,,,,,,,,023-623-1104,,,,,,,,��Ö@�l�c�D����,,,,,,,,
062014,,�R�`���R�`�s,�ϐ���R�`�K��Ō�X�e�[�V����,,,�K��Ō�,,,�R�`���R�`�s�����V�X�|�P,,,,,,,,,,023-682-0135,,,,,,,,�Љ���@�l�������c�ϐ���x���R�`���ϐ���,,,,,,,,
062014,,�R�`���R�`�s,�ϐ���R�`�K��Ō�X�e�[�V����,,,���\�h�K��Ō�,,,�R�`���R�`�s�����V�X�|�P,,,,,,,,,,023-682-0135,,,,,,,,�Љ���@�l�������c�ϐ���x���R�`���ϐ���,,,,,,,,
062014,,�R�`���R�`�s,�ݑ�n�r���Ō�X�e�[�V�����΂�,,,�K��Ō�,,,�R�`���R�`�s�c��U�ԂP�R��,,,,,,,,,,023-627-7011,,,,,,,,������Ѓ��j�o�[�T���R�`,,,,,,,,
062014,,�R�`���R�`�s,�ݑ�n�r���Ō�X�e�[�V�����΂�,,,���\�h�K��Ō�,,,�R�`���R�`�s�c��U�ԂP�R��,,,,,,,,,,023-627-7011,,,,,,,,������Ѓ��j�o�[�T���R�`,,,,,,,,
062014,,�R�`���R�`�s,�K��Ō�X�e�[�V�����~�̖�,,,�K��Ō�,,,�R�`���R�`�s�㒬�l����6��24��,,,,,,,,,,023-644-3364,,,,,,,,��a���f�B�J���������,,,,,,,,
062014,,�R�`���R�`�s,�K��Ō�X�e�[�V�����~�̖�,,,���\�h�K��Ō�,,,�R�`���R�`�s�㒬�l����6��24��,,,,,,,,,,023-644-3364,,,,,,,,��a���f�B�J���������,,,,,,,,
062014,,�R�`���R�`�s,�i�[�X�P�A�R�`,,,�K��Ō�,,,�R�`���R�`�s����񒚖ڂQ�ԂV��,,,,,,,,,,023-682-8544,,,,,,,,������Ѓ_�u���V�[�V�[,,,,,,,,
062014,,�R�`���R�`�s,�Z���g�P�A�K��Ō�X�e�[�V�����R�`,,,�K��Ō�,,,�R�`���R�`�s�\�����O���ڂU�ԂS�R��,,,,,,,,,,023-615-1014,,,,,,,,�Z���g�P�A���k�������,,,,,,,,
062014,,�R�`���R�`�s,�Z���g�P�A�K��Ō�X�e�[�V�����R�`,,,���\�h�K��Ō�,,,�R�`���R�`�s�\�����O���ڂU�ԂS�R��,,,,,,,,,,023-615-1014,,,,,,,,�Z���g�P�A���k�������,,,,,,,,
062014,,�R�`���R�`�s,�Z���g�P�A�K��Ō�X�e�[�V�����R�`,,,������x��,,,�R�`���R�`�s�\�����O���ڂU�ԂS�R��,,,,,,,,,,023-615-1014,,,,,,,,�Z���g�P�A���k�������,,,,,,,,
062014,,�R�`���R�`�s,�K��Ō�X�e�[�V���� �f���[���R�`,,,�K��Ō�,,,�R�`���R�`�s��쒬�꒚�ڂP�W�ԂP�V���@�_�C���U�T�w���Q�O�R����,,,,,,,,,,023-666-6557,,,,,,,,������Ђm�E�t�B�[���h,,,,,,,,
062014,,�R�`���R�`�s,�K��Ō�X�e�[�V���� �f���[���R�`,,,���\�h�K��Ō�,,,�R�`���R�`�s��쒬�꒚�ڂP�W�ԂP�V���@�_�C���U�T�w���Q�O�R����,,,,,,,,,,023-666-6557,,,,,,,,������Ђm�E�t�B�[���h,,,,,,,,
062014,,�R�`���R�`�s,�I�[���P�A�R�`,,,�K��Ō�,,,�R�`���R�`�s���c�O���ڂR�ԂP�T��,,,,,,,,,,023-674-8871,,,,,,,,������Ѓ����[�t,,,,,,,,
062014,,�R�`���R�`�s,�I�[���P�A�R�`,,,���\�h�K��Ō�,,,�R�`���R�`�s���c�O���ڂR�ԂP�T��,,,,,,,,,,023-674-8871,,,,,,,,������Ѓ����[�t,,,,,,,,
062014,,�R�`���R�`�s,���n�r�������^�@�K��Ō�X�e�[�V�����؂̉�,,,�K��Ō�,,,�R�`���R�`�s��𒬎l����5��23��,,,,,,,,,,023-665-5590,,,,,,,,������Ђ�����,,,,,,,,
062014,,�R�`���R�`�s,���n�r�������^�@�K��Ō�X�e�[�V�����؂̉�,,,���\�h�K��Ō�,,,�R�`���R�`�s��𒬎l����5��23��,,,,,,,,,,023-665-5590,,,,,,,,������Ђ�����,,,,,,,,
062014,,�R�`���R�`�s,�K��Ō�X�e�[�V�����@���C�Y,,,�K��Ō�,,,�R�`���R�`�s�����R�O�O-�T�P,,,,,,,,,,023-666-8211,,,,,,,,�������L.crip,,,,,,,,
062014,,�R�`���R�`�s,�K��Ō�X�e�[�V�����@���C�Y,,,���\�h�K��Ō�,,,�R�`���R�`�s�����R�O�O-�T�P,,,,,,,,,,023-666-8211,,,,,,,,�������L.crip,,,,,,,,
062014,,�R�`���R�`�s,�K��Ō샊�n�r���X�e�[�V�����h����,,,�K��Ō�,,,�R�`���R�`�s�쌴���O���ڂP�U�ԂP���@�����r���P�O�Q,,,,,,,,,,023-687-1420,,,,,,,,�Љ���@�l�h����,,,,,,,,
062014,,�R�`���R�`�s,�K��Ō샊�n�r���X�e�[�V�����h����,,,���\�h�K��Ō�,,,�R�`���R�`�s�쌴���O���ڂP�U�ԂP���@�����r���P�O�Q,,,,,,,,,,023-687-1420,,,,,,,,�Љ���@�l�h����,,,,,,,,
062014,,�R�`���R�`�s,�K��Ō�X�e�[�V�����S�ӋC,,,�K��Ō�,,,�R�`���R�`�s�n���P��꒚�ڂP�R�ԂQ�O��,,,,,,,,,,023-664-0660,,,,,,,,������Ж]��,,,,,,,,
062014,,�R�`���R�`�s,�K��Ō�X�e�[�V�����S�ӋC,,,���\�h�K��Ō�,,,�R�`���R�`�s�n���P��꒚�ڂP�R�ԂQ�O��,,,,,,,,,,023-664-0660,,,,,,,,������Ж]��,,,,,,,,
062014,,�R�`���R�`�s,�K��Ō�X�e�[�V�������Ԃ�,,,�K��Ō�,,,�R�`���R�`�s�������R�R�V�Ԓn,,,,,,,,,,023-615-8539,,,,,,,,�������Smile�@Breathing,,,,,,,,
062014,,�R�`���R�`�s,�K��Ō�X�e�[�V�������Ԃ�,,,���\�h�K��Ō�,,,�R�`���R�`�s�������R�R�V�Ԓn,,,,,,,,,,023-615-8539,,,,,,,,�������Smile�@Breathing,,,,,,,,
062014,,�R�`���R�`�s,�����܂�K��Ō�X�e�[�V����,,,�K��Ō�,,,�R�`���R�`�s��{�񒚖ڂP�V�ԂP��,,,,,,,,,,023-664-3166,,,,,,,,������Ђe�`�a�R,,,,,,,,
062014,,�R�`���R�`�s,�����܂�K��Ō�X�e�[�V����,,,���\�h�K��Ō�,,,�R�`���R�`�s��{�񒚖ڂP�V�ԂP��,,,,,,,,,,023-664-3166,,,,,,,,������Ђe�`�a�R,,,,,,,,
062014,,�R�`���R�`�s,��S�ف@�K��Ō�X�e�[�V�����@�R�`,,,�K��Ō�,,,�R�`���R�`�s�n���P��꒚�ڂP�O�ԂQ�T��,,,,,,,,,,023-666-5380,,,,,,,,������ЃA���r�X,,,,,,,,
062014,,�R�`���R�`�s,��S�ف@�K��Ō�X�e�[�V�����@�R�`,,,���\�h�K��Ō�,,,�R�`���R�`�s�n���P��꒚�ڂP�O�ԂQ�T��,,,,,,,,,,023-666-5380,,,,,,,,������ЃA���r�X,,,,,,,,
062014,,�R�`���R�`�s,�T���V���C���K��Ō�X�e�[�V����,,,�K��Ō�,,,�R�`���R�`�s��X�Q�P�R�X�Ԓn�P,,,,,,,,,,023-685-1225,,,,,,,,�Љ���@�l�R�`,,,,,,,,
062014,,�R�`���R�`�s,�T���V���C���K��Ō�X�e�[�V����,,,���\�h�K��Ō�,,,�R�`���R�`�s��X�Q�P�R�X�Ԓn�P,,,,,,,,,,023-685-1225,,,,,,,,�Љ���@�l�R�`,,,,,,,,
062014,,�R�`���R�`�s,�K��Ō�X�e�[�V�����ȂȂ���,,,�K��Ō�,,,�R�`���R�`�s�������񒚖ڂV�ԂQ�O��,,,,,,,,,,023-676-5277,,,,,,,,������Ў���,,,,,,,,
062014,,�R�`���R�`�s,�K��Ō�X�e�[�V�����ȂȂ���,,,���\�h�K��Ō�,,,�R�`���R�`�s�������񒚖ڂV�ԂQ�O��,,,,,,,,,,023-676-5277,,,,,,,,������Ў���,,,,,,,,
062014,,�R�`���R�`�s,�K��Ō�X�e�[�V����YONEKI,,,�K��Ō�,,,�R�`���R�`�s�����˃P�u�񒚖ڂP�ԂS��,,,,,,,,,,023-616-7515,,,,,,,,������Ђ�˂�,,,,,,,,
062014,,�R�`���R�`�s,�K��Ō�X�e�[�V����YONEKI,,,���\�h�K��Ō�,,,�R�`���R�`�s�����˃P�u�񒚖ڂP�ԂS��,,,,,,,,,,023-616-7515,,,,,,,,������Ђ�˂�,,,,,,,,
062014,,�R�`���R�`�s,�݉���ǖK��Ō�X�e�[�V�������̎�,,,�K��Ō�,,,�R�`���R�`�s�������꒚�ڂQ�ԂR�T���@�s�m�X�r���Q�K,,,,,,,,,,023-676-7770,,,,,,,,��������݉����,,,,,,,,
062014,,�R�`���R�`�s,�݉���ǖK��Ō�X�e�[�V�������̎�,,,���\�h�K��Ō�,,,�R�`���R�`�s�������꒚�ڂQ�ԂR�T���@�s�m�X�r���Q�K,,,,,,,,,,023-676-7770,,,,,,,,��������݉����,,,,,,,,
062014,,�R�`���R�`�s,�K��Ō�X�e�[�V�����@�Ђ܂��,,,�K��Ō�,,,�R�`���R�`�s�������꒚�ڂQ�ԂR�U��,,,,,,,,,,023-616-6280,,,,,,,,������Ѓ��f�B�J�����f�B�X��,,,,,,,,
062014,,�R�`���R�`�s,�K��Ō�X�e�[�V�����@�Ђ܂��,,,���\�h�K��Ō�,,,�R�`���R�`�s�������꒚�ڂQ�ԂR�U��,,,,,,,,,,023-616-6280,,,,,,,,������Ѓ��f�B�J�����f�B�X��,,,,,,,,
062014,,�R�`���R�`�s,��S�ف@�K��Ō�X�e�[�V�����@�R�`�U,,,�K��Ō�,,,�R�`���R�`�s��h���񒚖ڂP�S�ԂQ��,,,,,,,,,,023-664-2062,,,,,,,,������ЃA���r�X,,,,,,,,
062014,,�R�`���R�`�s,��S�ف@�K��Ō�X�e�[�V�����@�R�`�U,,,���\�h�K��Ō�,,,�R�`���R�`�s��h���񒚖ڂP�S�ԂQ��,,,,,,,,,,023-664-2062,,,,,,,,������ЃA���r�X,,,,,,,,
062014,,�R�`���R�`�s,�E�B���K��Ō�X�e�[�V�����R�`,,,�K��Ō�,,,�R�`���R�`�s���򐼈꒚�ڂP�O�ԂQ���p���e�B�[������P�O�R����,,,,,,,,,,023-666-8207,,,,,,,,�������kukuru,,,,,,,,
062014,,�R�`���R�`�s,�E�B���K��Ō�X�e�[�V�����R�`,,,���\�h�K��Ō�,,,�R�`���R�`�s���򐼈꒚�ڂP�O�ԂQ���p���e�B�[������P�O�R����,,,,,,,,,,023-666-8207,,,,,,,,�������kukuru,,,,,,,,
062014,,�R�`���R�`�s,�K��Ō�X�e�[�V�����a���@��܂���,,,�K��Ō�,,,�R�`���R�`�s�]���l���ڂP�W�ԂQ�X���@�T�j�[���]���PF,,,,,,,,,,023-616-3907,,,,,,,,������ЍN�Պ�,,,,,,,,
062014,,�R�`���R�`�s,�K��Ō�X�e�[�V�����a���@��܂���,,,���\�h�K��Ō�,,,�R�`���R�`�s�]���l���ڂP�W�ԂQ�X���@�T�j�[���]���PF,,,,,,,,,,023-616-3907,,,,,,,,������ЍN�Պ�,,,,,,,,
062014,,�R�`���R�`�s,�A�C�m�A�K��Ō�X�e�[�V����,,,�K��Ō�,,,�R�`���R�`�s�쌴���񒚖�8��47���@�쌴�A�l�b�N�X�Q�K�k,,,,,,,,,,023-679-5855,,,,,,,,������ЃA�C�m�A,,,,,,,,
062014,,�R�`���R�`�s,�A�C�m�A�K��Ō�X�e�[�V����,,,���\�h�K��Ō�,,,�R�`���R�`�s�쌴���񒚖�8��47���@�쌴�A�l�b�N�X�Q�K�k,,,,,,,,,,023-679-5855,,,,,,,,������ЃA�C�m�A,,,,,,,,
062014,,�R�`���R�`�s,SOIN�K��Ō�X�e�[�V�����R�`,,,�K��Ō�,,,�R�`���R�`�s�t�����X�ԂS�@�t�����݃e�i���g,,,,,,,,,,023-676-6577,,,,,,,,�������s-edge,,,,,,,,
062014,,�R�`���R�`�s,SOIN�K��Ō�X�e�[�V�����R�`,,,���\�h�K��Ō�,,,�R�`���R�`�s�t�����X�ԂS�@�t�����݃e�i���g,,,,,,,,,,023-676-6577,,,,,,,,�������s-edge,,,,,,,,
062014,,�R�`���R�`�s,�A�E���K��Ō�X�e�[�V�����R�`,,,�K��Ō�,,,�R�`���R�`�s�K���P�Q�ԂQ�T���@�t���[��two�@�P�O�P,,,,,,,,,,090-6251-6665,,,,,,,,������ЃP�A���{,,,,,,,,
062014,,�R�`���R�`�s,�A�E���K��Ō�X�e�[�V�����R�`,,,���\�h�K��Ō�,,,�R�`���R�`�s�K���P�Q�ԂQ�T���@�t���[��two�@�P�O�P,,,,,,,,,,090-6251-6665,,,,,,,,������ЃP�A���{,,,,,,,,
062014,,�R�`���R�`�s,�w�苏����x�����Ə��Ȃ��܂���,,,������x��,,,�R�`���R�`�s�����V�T�P�Ԓn,,,,,,,,,,023-681-2865,,,,,,,,�Љ���@�l�������c�ϐ���x���R�`���ϐ���,,,,,,,,
062014,,�R�`���R�`�s,�Ƃ��݋������w�苏����x�����Ə�,,,������x��,,,�R�`���R�`�s�x�_�O�U�Ԓn,,,,,,,,,,023-646-5037,,,,,,,,�Љ���@�l��܂����s��������,,,,,,,,
062014,,�R�`���R�`�s,�w�苏����x�����Ə�������,,,������x��,,,�R�`���R�`�s�������S�Ԓn,,,,,,,,,,023-631-9955,,,,,,,,�Љ���@�l�������c�ϐ���x���R�`���ϐ���,,,,,,,,
062014,,�R�`���R�`�s,������p���X�w�苏����x�����Ə�,,,������x��,,,�R�`���R�`�s���c���l���ڂP�ԂP�S��,,,,,,,,,,023-633-3107,,,,,,,,��Ö@�l�Вc�I����,,,,,,,,
062014,,�R�`���R�`�s,�݂�����̉��w�苏����x�����Ə�,,,������x��,,,�R�`���R�`�s���؉��͌��P�P�Q�X�Ԓn�P,,,,,,,,,,023-644-7160,,,,,,,,�Љ���@�l�R�`���a��,,,,,,,,
062014,,�R�`���R�`�s,�R�`�s�Љ�����c�����x�����Ə�,,,������x��,,,�R�`���R�`�s�鐼���񒚖ڂQ�ԂQ�Q��,,,,,,,,,,023-647-9753,,,,,,,,�Љ���@�l�R�`�s�Љ�����c��,,,,,,,,
062014,,�R�`���R�`�s,������x�����Ə��K��Ō�X�e�[�V������܂���,,,������x��,,,�R�`���R�`�s���h�꒚�ڂT�ԂU�R��,,,,,,,,,,023-685-8082,,,,,,,,���v�Вc�@�l�R�`���Ō싦��,,,,,,,,
062014,,�R�`���R�`�s,���������{�݂��������̋�,,,�ʏ����,,,�R�`���R�`�s�����S�Q�T�Ԓn�Q,,,,,,,,,,023-681-2940,,,,,,,,�Љ���@�l�P���̉�,,,,35,,,,
062014,,�R�`���R�`�s,���������{�݂��������̋�,,,�Z�������������,,,�R�`���R�`�s�����S�Q�T�Ԓn�Q,,,,,,,,,,023-681-2940,,,,,,,,�Љ���@�l�P���̉�,,,,20,,,,
062014,,�R�`���R�`�s,���������{�݂��������̋�,,,���\�h�Z�������������,,,�R�`���R�`�s�����S�Q�T�Ԓn�Q,,,,,,,,,,023-681-2940,,,,,,,,�Љ���@�l�P���̉�,,,,,,,,
062014,,�R�`���R�`�s,���������{�݂��������̋�,,,������x��,,,�R�`���R�`�s�����S�Q�T�Ԓn�Q,,,,,,,,,,023-681-4765,,,,,,,,�Љ���@�l�P���̉�,,,,,,,,
062014,,�R�`���R�`�s,�w�苏����x�����Ə��ϐ���R�`�K��Ō�X�e�[�V����,,,������x��,,,�R�`���R�`�s�����V�X�Ԓn�̂P�@�R�`�ϐ��a�@,,,,,,,,,,023-682-0135,,,,,,,,�Љ���@�l�������c�ϐ���x���R�`���ϐ���,,,,,,,,
062014,,�R�`���R�`�s,�w�苏����x�����Ə��T�j�[�q������,,,������x��,,,�R�`���R�`�s��������̋u�V�Q�V�Ԓn�Q�O,,,,,,,,,,023-645-8500,,,,,,,,��ʍ��c�@�l�R�`�s���N������Î��ƒc,,,,,,,,
062014,,�R�`���R�`�s,�w�苏����x�����Ə��T�j�[�q���R��,,,������x��,,,�R�`���R�`�s�R���P�X�V�R�Ԓn�R�R�T,,,,,,,,,,023-667-5007,,,,,,,,��ʍ��c�@�l�R�`�s���N������Î��ƒc,,,,,,,,
062014,,�R�`���R�`�s,�݂�����̉��w��Z������������쎖�Ə�,,,�Z�������������,,,�R�`���R�`�s���؉��͌��P�P�Q�X�Ԓn�P,,,,,,,,,,023-644-7571,,,,,,,,�Љ���@�l�R�`���a��,,,,16,,,,
062014,,�R�`���R�`�s,�݂�����̉��w��Z������������쎖�Ə�,,,���\�h�Z�������������,,,�R�`���R�`�s���؉��͌��P�P�Q�X�Ԓn�P,,,,,,,,,,023-644-7571,,,,,,,,�Љ���@�l�R�`���a��,,,,,,,,
062014,,�R�`���R�`�s,�c�w�苏����x�����Ə�,,,������x��,,,�R�`���R�`�s�����Q�ԂU�W��,,,,,,,,,,023-629-8636,,,,,,,,��Ö@�l�c�D����,,,,,,,,
062014,,�R�`���R�`�s,�����₷�炬�̗��w�苏����x�����Ə�,,,������x��,,,�R�`���R�`�s�����������΍��V�X�ԂV,,,,,,,,,,023-688-8002,,,,,,,,�Љ���@�l����������,,,,,,,,
062014,,�R�`���R�`�s,������Ђ����Ղ�P�A�T�[�r�X,,,�K����,,,�R�`���R�`�s�v�ۓc�꒚��7��7��,,,,,,,,,,023-622-1199,,,,,,,,������Ђ����Ղ�P�A�T�[�r�X,,,,,,,,
062014,,�R�`���R�`�s,������Ђ����Ղ�P�A�T�[�r�X,,,�K��������,,,�R�`���R�`�s�v�ۓc�꒚��7��7��,,,,,,,,,,023-622-1199,,,,,,,,������Ђ����Ղ�P�A�T�[�r�X,,,,,,,,
062014,,�R�`���R�`�s,������Ђ����Ղ�P�A�T�[�r�X,,,���\�h�K��������,,,�R�`���R�`�s�v�ۓc�꒚��7��7��,,,,,,,,,,023-622-1199,,,,,,,,������Ђ����Ղ�P�A�T�[�r�X,,,,,,,,
062014,,�R�`���R�`�s,������Ђ����Ղ�P�A�T�[�r�X,,,������x��,,,�R�`���R�`�s�v�ۓc�꒚��7��7��,,,,,,,,,,023-622-1199,,,,,,,,������Ђ����Ղ�P�A�T�[�r�X,,,,,,,,
062014,,�R�`���R�`�s,�݂�����̉��w��ʏ���쎖�Ə�,,,�ʏ����,,,�R�`���R�`�s���؉��͌��P�P�Q�X�Ԓn�P,,,,,,,,,,023-644-7103,,,,,,,,�Љ���@�l�R�`���a��,,,,30,,,,
062014,,�R�`���R�`�s,�T���V���C����X�f�C�T�[�r�X�Z���^�[,,,�ʏ����,,,�R�`���R�`�s��X�Q�P�R�X�Ԓn�P,,,,,,,,,,023-685-1223,,,,,,,,�Љ���@�l�R�`,,,,20,,,,
062014,,�R�`���R�`�s,�T���V���C����X�V���[�g�X�e�C�Z���^�[,,,�Z�������������,,,�R�`���R�`�s��X�Q�P�R�X�Ԓn�P,,,,,,,,,,023-685-1226,,,,,,,,�Љ���@�l�R�`,,,,10,,,,
062014,,�R�`���R�`�s,�T���V���C����X�V���[�g�X�e�C�Z���^�[,,,���\�h�Z�������������,,,�R�`���R�`�s��X�Q�P�R�X�Ԓn�P,,,,,,,,,,023-685-1226,,,,,,,,�Љ���@�l�R�`,,,,,,,,
062014,,�R�`���R�`�s,�����₷�炬�̗��w��ʏ���쎖�Ə�,,,�ʏ����,,,�R�`���R�`�s�������X�Q�O�Ԓn,,,,,,,,,,023-688-7022,,,,,,,,�Љ���@�l����������,,,,30,,,,
062014,,�R�`���R�`�s,�����₷�炬�̗��w��Z������������쎖�Ə�,,,�Z�������������,,,�R�`���R�`�s�������X�Q�O�Ԓn,,,,,,,,,,023-688-7022,,,,,,,,�Љ���@�l����������,,,,10,,,,
062014,,�R�`���R�`�s,�����₷�炬�̗��w��Z������������쎖�Ə�,,,���\�h�Z�������������,,,�R�`���R�`�s�������X�Q�O�Ԓn,,,,,,,,,,023-688-7022,,,,,,,,�Љ���@�l����������,,,,,,,,
062014,,�R�`���R�`�s,�T���V���C����X������x���Z���^�[,,,������x��,,,�R�`���R�`�s��X�Q�P�R�X�Ԓn�P,,,,,,,,,,023-685-1218,,,,,,,,�Љ���@�l�R�`,,,,,,,,
062014,,�R�`���R�`�s,�R�`�s�Љ�����c��邵��܋�����x�����Ə�,,,������x��,,,�R�`���R�`�s���R�W�Q�Q�Ԓn,,,,,,,,,,023-685-5261,,,,,,,,�Љ���@�l�R�`�s�Љ�����c��,,,,,,,,
062014,,�R�`���R�`�s,�f�C�T�[�r�X�Z���^�[������,,,�ʏ����,,,�R�`���R�`�s�����쒬�񒚖ڂR�|�P,,,,,,,,,,023-616-5080,,,,,,,,�Љ���@�l�������c�ϐ���x���R�`���ϐ���,,,,25,,,,
062014,,�R�`���R�`�s,������Б����T�v���C�Y,,,�����p��ݗ^,,,�R�`���R�`�s�����񒚖ڂQ�P�ԂS��,,,,,,,,,,023-674-9600,,,,,,,,������Б����T�v���C�Y,,,,,,,,
062014,,�R�`���R�`�s,������Б����T�v���C�Y,,,���蕟���p��̔�,,,�R�`���R�`�s�����񒚖ڂQ�P�ԂS��,,,,,,,,,,023-674-9600,,,,,,,,������Б����T�v���C�Y,,,,,,,,
062014,,�R�`���R�`�s,������Б����T�v���C�Y,,,������\�h�����p��̔�,,,�R�`���R�`�s�����񒚖ڂQ�P�ԂS��,,,,,,,,,,023-674-9600,,,,,,,,������Б����T�v���C�Y,,,,,,,,
062014,,�R�`���R�`�s,������Б����T�v���C�Y,,,���\�h�����p��ݗ^,,,�R�`���R�`�s�����񒚖ڂQ�P�ԂS��,,,,,,,,,,023-674-9600,,,,,,,,������Б����T�v���C�Y,,,,,,,,
062014,,�R�`���R�`�s,������Ђ����Ղ�P�A�T�[�r�X���p�i�V���b�v�����Ղ�,,,�����p��ݗ^,,,�R�`���R�`�s�v�ۓc�꒚��7��7��,,,,,,,,,,023-624-7171,,,,,,,,������Ђ����Ղ�P�A�T�[�r�X,,,,,,,,
062014,,�R�`���R�`�s,������Ђ����Ղ�P�A�T�[�r�X���p�i�V���b�v�����Ղ�,,,���蕟���p��̔�,,,�R�`���R�`�s�v�ۓc�꒚��7��7��,,,,,,,,,,023-624-7171,,,,,,,,������Ђ����Ղ�P�A�T�[�r�X,,,,,,,,
062014,,�R�`���R�`�s,������Ђ����Ղ�P�A�T�[�r�X���p�i�V���b�v�����Ղ�,,,������\�h�����p��̔�,,,�R�`���R�`�s�v�ۓc�꒚��7��7��,,,,,,,,,,023-624-7171,,,,,,,,������Ђ����Ղ�P�A�T�[�r�X,,,,,,,,
062014,,�R�`���R�`�s,������Ђ����Ղ�P�A�T�[�r�X���p�i�V���b�v�����Ղ�,,,���\�h�����p��ݗ^,,,�R�`���R�`�s�v�ۓc�꒚��7��7��,,,,,,,,,,023-624-7171,,,,,,,,������Ђ����Ղ�P�A�T�[�r�X,,,,,,,,
062014,,�R�`���R�`�s,�w��ʏ���쎖�Ə��Ȃ��܂���,,,�ʏ����,,,�R�`���R�`�s�����V�T�P�Ԓn,,,,,,,,,,023-681-7589,,,,,,,,�Љ���@�l�������c�ϐ���x���R�`���ϐ���,,,,30,,,,
062014,,�R�`���R�`�s,�w��Z������������쎖�Ə��Ȃ��܂���,,,�Z�������������,,,�R�`���R�`�s�����V�T�P�Ԓn,,,,,,,,,,023-684-2391,,,,,,,,�Љ���@�l�������c�ϐ���x���R�`���ϐ���,,,,20,,,,
062014,,�R�`���R�`�s,�w��Z������������쎖�Ə��Ȃ��܂���,,,���\�h�Z�������������,,,�R�`���R�`�s�����V�T�P�Ԓn,,,,,,,,,,023-684-2391,,,,,,,,�Љ���@�l�������c�ϐ���x���R�`���ϐ���,,,,,,,,
062014,,�R�`���R�`�s,�j�`�C�P�A�Z���^�[�R�`,,,�K����,,,�R�`���R�`�s�㒬�O���ڂP�Q�ԂU��,,,,,,,,,,023-647-1951,,,,,,,,������Ѓj�`�C�w��,,,,,,,,
062014,,�R�`���R�`�s,�j�`�C�P�A�Z���^�[�R�`,,,�ʏ����,,,�R�`���R�`�s�㒬�O���ڂP�Q�ԂU��,,,,,,,,,,023-647-1951,,,,,,,,������Ѓj�`�C�w��,,,,31,,,,
062014,,�R�`���R�`�s,�j�`�C�P�A�Z���^�[�R�`,,,������x��,,,�R�`���R�`�s�㒬�O���ڂP�Q�ԂU��,,,,,,,,,,023-647-1951,,,,,,,,������Ѓj�`�C�w��,,,,,,,,
062014,,�R�`���R�`�s,�w�苏����x�����Ə���������,,,������x��,,,�R�`���R�`�s��������̋u�S�U�Ԓn,,,,,,,,,,023-646-1162,,,,,,,,�Љ���@�l�R�`�s�Љ�����ƒc,,,,,,,,
062014,,�R�`���R�`�s,�h����������x�����Ə�,,,������x��,,,�R�`���R�`�s�������T�O�O�Ԓn�̂P,,,,,,,,,,023-634-2310,,,,,,,,�Љ���@�l�h����,,,,,,,,
062014,,�R�`���R�`�s,�w��Z������������쎖�Ə�������,,,�Z�������������,,,�R�`���R�`�s�������S�Ԓn,,,,,,,,,,023-632-2791,,,,,,,,�Љ���@�l�������c�ϐ���x���R�`���ϐ���,,,,10,,,,
062014,,�R�`���R�`�s,�w��Z������������쎖�Ə�������,,,���\�h�Z�������������,,,�R�`���R�`�s�������S�Ԓn,,,,,,,,,,023-632-2791,,,,,,,,�Љ���@�l�������c�ϐ���x���R�`���ϐ���,,,,,,,,
062014,,�R�`���R�`�s,�킽���̉�K���쎖�Ə�,,,�K����,,,�R�`���R�`�s�㒬�P���ڂX�ԂP�V��,,,,,,,,,,023-644-4875,,,,,,,,�����c�������@�l�R�`�킽���̉�,,,,,,,,
062014,,�R�`���R�`�s,�w��ʏ���쎖�Ə�����f�C�T�[�r�X�Z���^�[,,,�ʏ����,,,�R�`���R�`�s��������̋u�S�U�Ԓn,,,,,,,,,,023-646-1168,,,,,,,,�Љ���@�l�R�`�s�Љ�����ƒc,,,,25,,,,
062014,,�R�`���R�`�s,�w��ʏ���쎖�Ə�����f�C�T�[�r�X�Z���^�[,,,�F�m�ǑΉ��^�ʏ����,,,�R�`���R�`�s��������̋u�S�U�Ԓn,,,,,,,,,,023-646-1168,,,,,,,,�Љ���@�l�R�`�s�Љ�����ƒc,,,,10,,,,
062014,,�R�`���R�`�s,�w��ʏ���쎖�Ə�����f�C�T�[�r�X�Z���^�[,,,���\�h�F�m�ǑΉ��^�ʏ����,,,�R�`���R�`�s��������̋u�S�U�Ԓn,,,,,,,,,,023-646-1168,,,,,,,,�Љ���@�l�R�`�s�Љ�����ƒc,,,,,,,,
062014,,�R�`���R�`�s,�w��Z������������쎖�Ə�����,,,�Z�������������,,,�R�`���R�`�s��������̋u�S�U�Ԓn,,,,,,,,,,023-646-1160,,,,,,,,�Љ���@�l�R�`�s�Љ�����ƒc,,,,18,,,,
062014,,�R�`���R�`�s,�w��Z������������쎖�Ə�����,,,���\�h�Z�������������,,,�R�`���R�`�s��������̋u�S�U�Ԓn,,,,,,,,,,023-646-1160,,,,,,,,�Љ���@�l�R�`�s�Љ�����ƒc,,,,,,,,
062014,,�R�`���R�`�s,�h�����K���쎖�Ə�,,,�K����,,,�R�`���R�`�s�������T�O�O�Ԓn�̂P,,,,,,,,,,023-634-2020,,,,,,,,�Љ���@�l�h����,,,,,,,,
062014,,�R�`���R�`�s,�h�����ʏ���쎖�Ə�,,,�ʏ����,,,�R�`���R�`�s�������T�O�O�Ԓn�̂P,,,,,,,,,,023-634-2308,,,,,,,,�Љ���@�l�h����,,,,45,,,,
062014,,�R�`���R�`�s,�j�`�C�P�A�Z���^�[�R�`�܏\��,,,�K����,,,�R�`���R�`�s�܏\��񒚖ڂQ�|�U�W,,,,,,,,,,023-626-4455,,,,,,,,������Ѓj�`�C�w��,,,,,,,,
062014,,�R�`���R�`�s,�j�`�C�P�A�Z���^�[�R�`�܏\��,,,�ʏ����,,,�R�`���R�`�s�܏\��񒚖ڂQ�|�U�W,,,,,,,,,,023-626-4455,,,,,,,,������Ѓj�`�C�w��,,,,30,,,,
062014,,�R�`���R�`�s,�Ƃ��݋������f�C�T�[�r�X�Z���^�[,,,�ʏ����,,,�R�`���R�`�s�x�_�O�U�Ԓn,,,,,,,,,,023-646-5056,,,,,,,,�Љ���@�l��܂����s��������,,,,30,,,,
062014,,�R�`���R�`�s,�Ƃ��݋������f�C�T�[�r�X�Z���^�[,,,�F�m�ǑΉ��^�ʏ����,,,�R�`���R�`�s�x�_�O�U�Ԓn,,,,,,,,,,023-646-5056,,,,,,,,�Љ���@�l��܂����s��������,,,,12,,,,
062014,,�R�`���R�`�s,�Ƃ��݋������f�C�T�[�r�X�Z���^�[,,,���\�h�F�m�ǑΉ��^�ʏ����,,,�R�`���R�`�s�x�_�O�U�Ԓn,,,,,,,,,,023-646-5056,,,,,,,,�Љ���@�l��܂����s��������,,,,,,,,
062014,,�R�`���R�`�s,�Ƃ��݋������w��Z������������쎖�Ə�,,,�Z�������������,,,�R�`���R�`�s�x�_�O�U�Ԓn,,,,,,,,,,023-646-5052,,,,,,,,�Љ���@�l��܂����s��������,,,,20,,,,
062014,,�R�`���R�`�s,�Ƃ��݋������w��Z������������쎖�Ə�,,,���\�h�Z�������������,,,�R�`���R�`�s�x�_�O�U�Ԓn,,,,,,,,,,023-646-5052,,,,,,,,�Љ���@�l��܂����s��������,,,,,,,,
062014,,�R�`���R�`�s,�F�m�Ǎ���҃O���[�v�z�[���h����,,,�F�m�ǑΉ��^�����������,,,�R�`���R�`�s�������T�O�O�|�P,,,,,,,,,,023-634-2020,,,,,,,,�Љ���@�l�h����,,,,36,,,,