�S���n�������c�̃R�[�h,�@�l�ԍ�,ID,�n�������c�̖�,����,����_�J�i,����_�p��,POI�R�[�h,���ݒn_�S���n�������c�̃R�[�h,����ID,���ݒn_�A���\�L,���ݒn_�s���{��,���ݒn_�s�撬��,���ݒn_����,���ݒn_�Ԓn�ȉ�,��������(����),�ܓx,�o�x,���x�̎��,���x�̒l,���p�\�j��,�J�n����,�I������,���p�\�������L����,����(��{),����(�ڍ�),����,����_�p��,�A�N�Z�X���@,���ԏ���,�Ԉ֎q��,�Ԉ֎q�ݏo,�c�G�ݏo,�o���A�t���[�g�C��,�X���[�v�A�G���x�[�^�A�G�X�J���[�^,�_���u���b�N���̈ړ��x��,�_����Ǐ�ɂ��x��,�ӓ����E����A����������,����,�M�k�Ή�,�D�撓�ԏ�,�I�X�g���C�g�Ή��g�C��,������,���ނւ��R�[�i�[,���H��,�x�r�[�J�[�ݏo,�x�r�[�J�[���p,�A���於��,�A����d�b�ԍ�,�A��������ԍ�,�A���惁�[���A�h���X,�A����FormURL,�A������l�i���̑��ASNS�Ȃǁj,�X�֔ԍ�,�摜,�摜_���C�Z���X,URL,���l
062014,,,�R�`���R�`�s,�R�`�s���y��,���}�K�^�V�L���E�h�J��,,,062014,,�R�`���R�`�s���钬1-1,�R�`��,�R�`�s,���钬,1-1,,38.253312,140.328653,,,���ΐ��؋��y��,9:00,16:30,�N���N�n�x��,0 ,,����������Ɍ��O�w�O�P�U�p�`�̗m�����z���B��Ë@�펑����R�`�̋��y������W�����Ă��܂��B,,�R�`�w�����������������o�R�œk����15��,,,,,,,,,,,,,,,,,,,,,,,,,,,,,
062014,,,�R�`���R�`�s,�R�`��ՁE��m�ۓ�����,���}�K�^�V�W���E�Z�L�E�j�m�}���q�K�V�I�I�e����,,,062014,,�R�`���R�`�s���钬1-10,�R�`��,�R�`�s,���钬,1-10,,38.255115,140.332046,,,���ΐ��؋��y��,5:00,22:00,�������J��4����{�`11�����{�܂�,0 ,,�R�`�̏�ՁE��������̕~�n���ɂ�����{���w�̏��B�U�N�̍Ό��������ĕ�������܂����B,,�R�`�w��������k��15��,���ԑ䐔450�䂤���g�̏Ⴊ���ғ��p���ԃX�y�[�X5��,,,,,,,,,,,,,,,,,,,,,,,,,,,,
062014,,,�R�`���R�`�s,�R�`���p��,���}�K�^�r�W���c�J��,,,062014,,�R�`���R�`�s��蒬1-63,�R�`��,�R�`�s,��蒬,1-63,,38.255897,140.332408,,,�ΐ��؋��y��,10:00,17:00,,600 ,���600�~�A���吶300�~�A������100�~,�s�J�\����V���K�[���A�����q�K�A�^�ӕ����܂ŃW���������Ƃ킸�A���E���̌|�p��i���W�ߓW�����Ă��܂��B,,�R�`�w��������k��15��,�R�`���p�ٖk���ɖ������ԏ�,,,,,,,,,,,,,,,,,,,,,,,,,,,,
062014,,,�R�`���R�`�s,�ŏ�`�����j��,���K�~���V�A�L���L�V�J��,,,062014,,�R�`���R�`�s��蒬1-53,�R�`��,�R�`�s,��蒬,1-53,,38.2551,140.333433,,,�ΐ��؋��y��,9:00,17:00,,0 ,,�R�`�̏鉺���̊�b��z������P�P����ŏ�`��(1546-1614)�𒆐S�ɁA�R�`��ɂ܂��֌W�����𑽂��W�����Ă��܂��B,,�R�`�w��������k��15��,,,,,,,,,,,,,,,,,,,,,,,,,,,,,
062014,,,�R�`���R�`�s,���C���R�����{,�`���E�J�C�K�b�T�������E�V���m�~��,,,062014,,�R�`���R�`�s�{��3-8-41,�R�`��,�R�`�s,�{���R,8-41,,38.270922,140.337183,,,���ΐ��؋��y��,,,,,,�ŏ�Ƒ�X�̑��@���󂯂��R�`��k�̒���ł���A�R�`����̑傫�Ȑ_�ЁB�{�a���s�w��A���_��s�����w��̗L�`�������Ɏw�肳��Ă��܂��B,,�k�R�`�w����k��10��,�L��,,,,,,,,,,,,,,,,,,,,,,,,,,,,
062014,,,�R�`���R�`�s,���̒����@��������a��,�~�Y�m�}�`���@�i�m�J�}�`�S�e���[�L,,,062014,,�R�`���R�`�s������2-7-6,�R�`��,�R�`�s,�������Q,7-6,,38.254195,140.342835,,,���ΐ��؋��y��,,,,,,�V�܂ƃ��_�������݂��A�R�`�̗��j�Ɠ`���A�����ĎR�`���̍Ő�[�̏�񂪋Ïk���������̋�Ԃł��B,,�R�`�w����o�X��10���u�������v���� �k����2��,,,,,,,,,,,,,,,,,,,,,,,,,,,,,
062014,,,�R�`���R�`�s,���Ċ�,�u���V���E�J��,,,062014,,�R�`���R�`�s���U��3-4-51,�R�`��,�R�`�s,���U���R,4-51,,38.256897,140.341246,,,���ΐ��؋��y��,9:00,16:30,��1�E��3���j���͋x��,0 ,,�吳�T�N�ɎR�`�����ɂƌ���c�����Ƃ��Č��Ă�ꂽ�C�M���X���l�b�T���X�l���̌����B�����V�N�ɏC������A���̏d�v�������ɂ��w�肳��Ă��܂��B,,�R�`�w����s�����o�R�H���o�X�Ŏs�����O���ԁE�k��1��,���Ċٖk���i��40��j,,,,,,,,,,,,,,,,,,,,,,,,,,,,
062014,,,�R�`���R�`�s,���玑����,�L���E�C�N�V�����E�J��,,,062014,,�R�`���R�`�s�Β�2-2-8,�R�`��,�R�`�s,�Β��Q,2-8,,38.254358,140.348322,,,�ΐ��؋��y��,9:00,16:30,�j���͋x��,150 ,���N150�~�A�w��70�~,�����P�P�N�Ɍ��Ă�ꂽ���l�b�T���X���̌����B�����ł͎R�`���̋��玑����W�����Ă��܂��B,,�R�`�w�����������������o�R�œk����P�O��,�����ّO�ɖ������ԏ�L��@���ʎԁF�ő�P�O��,,,,,,,,,,,,,,,,,,,,,,,,,,,,
062014,,,�R�`���R�`�s,��������t��,�R�N�u���W���N�V�h�E,,,062014,,�R�`���R�`�s��t��2-8-88,�R�`��,�R�`�s,��t���Q,8-88,,38.261133,140.346554,,,���ΐ��؋��y��,,,,,,�����V�c����V���X�N�̌����B���N�T���ɍ՗�u��t�܂�v���s���Ă��܂��B,,�R�`�w����o�X��15�� ,�L��,,,,,,,,,,,,,,,,,,,,,,,,,,,,
062014,,,�R�`���R�`�s,��܂����N���G�C�e�B�u�V�e�B�Z���^�[�p�P(���R�`�܂Ȃъفj,���}�K�^�N���G�C�e�B�u�V�e�B�Z���^�[�L���[�C�`,,,062014,,�R�`���R�`�s�{��1-5-19,�R�`��,�R�`�s,�{���P,5-19,,38.250695,140.335776,,,�ΐ��؋��y��,9:00,18:00,�W���{�݌��w�\����,0 ,,�R�`�����̓S�؃R���N���[�g���Z�ɂƂ��ēo�^�L�`�������Ɏw�肳�ꂽ�u�R�`�s����ꏬ�w�Z���Z�Ɂv��n���s�s�̋��_�Ƃ��ă��j���[�A���B�ٓ��ł͎R�`�s�̗��j�����Ƌ��玑�����W������Ă��܂��B,,�R�`�w����k��15��,�Ȃ�,,,,,,,,,,,,,,,,,,,,,,,,,,,,
062014,,,�R�`���R�`�s,��̎�,�Z���V���E�W,,,062014,,�R�`���R�`�s�Β�3-7-67,�R�`��,�R�`�s,�Β��Q,7-67,,38.251818,140.346438,,,���ΐ��؋��y��,,,,,,�L�b�G���̂��ƂɂƂ��A���s�O���͌��Ŕߌ��I�Ȏ��𐋂����ŏ�`���̈����E��P�̕�񎛁B�{���́A�s�w��L�`�������B,,�R�`�w����o�X��10�� ,,,,,,,,,,,,,,,,,,,,,,,,,,,,,
062014,,,�R�`���R�`�s,�R�`�܂邲�Ɗٍg�̑�,���}�K�^�}���S�g�J���x�j�m�N��,,,062014,,�R�`���R�`�s�\����2-1-8,�R�`��,�R�`�s,�\�����Q,1-8,,38.246688,140.335658,,,���ΐ��؋��y��,,,�x�ٓ���1��1���i��x���͊e�X�܂ɂ��قȂ�܂��B�j,,,��l�������c�������j�╶�����������Ȃ���A�V���Ȗ��͂̑n����ڎw���Ă��܂��B�H���͂��߂Ƃ���u�R�`�̖��́v�������\�������B,,�R�`�w���k��10�����x ,�L��,,,,,,,,,,,,,,,,,,,,,,,,,,,,
062014,,,�R�`���R�`�s,���݂�����,���~�W�R�E�G��,,,062014,,�R�`���R�`�s������2-16-7,�R�`��,�R�`�s,�������Q,16-7,,38.245627,140.344563,,,���ΐ��؋��y��,,,��g�فi�������j���j�x�فB,,,�g�t�̖����Ƃ��Đe���܂�Ă���r���V���뉀�ł��B�����ɂ͐��񉮑���A�P�W�O��̒�����������{�i�I�Ȓ��u��g���v�����݂���Ă��܂��B,,�R�`�w����o�X��15���@�u����3���ځv�o�X����k����3��,�L��,,,,,,,,,,,,,,,,,,,,,,,,,,,,
062014,,,�R�`���R�`�s,�ݏ���,�o���V���E�W,,,062014,,�R�`���R�`�s������247,�R�`��,�R�`�s,������,247,,38.236856,140.36474,,,���ΐ��؋��y��,,,,,,�R�`�s���ے������ΎR�ɘȂގ��B�P�R�O�O�N�قǑO������P�ɂ���ĊJ���ꂽ�ƌ����A���X�̓`�����c���Ă��܂��B,,�R�`�w����o�X��20�� �u�R�`�����O�v�o�X����k����5��,�L��,,,,,,,,,,,,,,,,,,,,,,,,,,,,
062014,,,�R�`���R�`�s,�����ω���,�J���}�c�J���m���h�E,,,062014,,�R�`���R�`�s�厚�߉ޓ����㓂��502,�R�`��,�R�`�s,�߉ޓ����㓂��,502,,38.244049,140.392319,,,���ΐ��؋��y��,,,,,,���̐�����͂��đ���ꂽ���R����̊ω����B��h��̓����R�X�̗΂ɉf���ēƓ��̕��͋C�������o���Ă��܂��B,,�R�`�w����o�X��25�� �u�����ω����v�o�X����k����5��,�L��,,,,,,,,,,,,,,,,,,,,,,,,,,,,
062014,,,�R�`���R�`�s,������I�V���C,�U�I�E�_�C���e���u��,,,062014,,�R�`���R�`�s��������r�~853-3,�R�`��,�R�`�s,��������r�~,853-3,,38.166167,140.401809,,,���ΐ��؋��y��,9:30,17:30,�y���j��18:30�܂ŁB�Վ���ԉc�Ƃ���B11�����{�`��3���܂ł͕�,700 ,��l700�~�@�q���i12�Ζ����j400�~,��̗���Ɩ쒹�̂�������A��������Ɠ��̗����̓����A�����Ȃ�ł͂̂Ђ���Ƃ�����C�A�ڂɔ�э���ł���厩�R�c���������I�V���C�͌���|�������B�l�G�������A�s��Ȏ��R�̒��ɖ����鑠���̓��ŁA�S���g�̂�������Ă��������B ,,�o�X�@��������s�@�I�_���ԁ`�k��18��,���p�Ґ�p���ԏꂠ��i60��j,,,,,,,,,,,,,,,,,,,,,,,,,,,,
062014,,,�R�`���R�`�s,���Ύ�,���b�V���N�W,,,062014,,�R�`���R�`�s�R��4456-1,�R�`��,�R�`�s,�R��,4456-1,,38.311841,140.434853,,,���ΐ��؋��y��,,,,300 ,�R��/���̉@�@��l300�~�@���l(���w��)200�~�@���l(�l�Ύ��ȏ�) 100�~,���2�N(860)�A��O���V����厜�o��t�~�m���J�����A�V��@�̌�R�œ��k���\�����R�ł��B�u�Ղ��� ��ɂ��ݓ��� ��̐��v�Ƃ��������m�Ԃ̋�ł��m���Ă��܂��B�L���Ȏ��R�Ɍb�܂�A�t�E�āE�H�E�~�A�l�G�܁X�̕��͋C���y���ނ��Ƃ��ł��܂��B ,,�R�`�w���玩���Ԃ�30���AJR��R����20��,,,,,,,,,,,,,,,,,,,,,,,,,,,,,
