�S���n�������c�̃R�[�h,�@�l�ԍ�,ID,�n�������c�̖�,�C�x���g��,����R�[�h,�C�x���g�ʏ�,�T�u�^�C�g��,�C�x���g��_�J�i,�C�x���g��_�p��,�R���e���cURL,���,�L�[���[�h,�^�O,�ΏۂƂȂ�Y��,�J�Ãp�^�[��,�J�n��,�I����,�J�n����,�I������,�J�n�������L����,���v����,�f�ڊJ�n��,�f�ڏI����,�T�v,����,�T�u�C�x���g,�C�x���g���,����(��{),����(�ڍ�),�A���於��,�A����d�b�ԍ�,�A��������ԍ�,��Î�,���Òc��,�֘A�g�D,�Ώێ�,�ΏێҔ��l,�ꏊ����,�W���i��t�j�ꏊ,���ݒn_�S���n�������c�̃R�[�h,����ID,���ݒn_�A���\�L,���ݒn_�s���{��,���ݒn_�s�撬��,���ݒn_����,���ݒn_�Ԓn�ȉ�,��������(����),�ܓx,�o�x,�A�N�Z�X���@,���ԏ���,���ԏꗿ��,���֏���,Web�J��,Web�J��URL,�c�[���E��,���,������l,�������,���ώ��,�O����Ή�,�O����Ή����l,�J�Ï���,�Q���\���I����,�Q���\���I������,�Q���\�����@,�\���J�n��,�\���J�n����,�\��URL,URL,������,���ނւ��R�[�i�[,���H��,�x�r�[�J�[�ݏo,�x�r�[�J�[���p,�摜,�摜_���C�Z���X,���l
062014,,,,����ύ���,JA,,,�J�W���E�J���I�E�J�C,,,,,,,���炫�n�߁`�U��n�߂܂�,2024-04-01,2024-04-15,05:00,22:00,,,,,,�R�`�s������̍��̖�����������ōs����u����ύ���v�B���̌����ɂ��킹�č����C�g�A�b�v�Ȃǂ��J�Â����B,,,,,,,,,,,,,�R�`�隬�@�������,,,,�R�`���R�`�s���钬,,,,,,38.255431,140.328076,,,,,,,,,,,,,,,,,,,,,,,,,,,,,
062014,,,,�n�����肳���烉�C�����C�g�A�b�v,JA,,,�}�~�K�T�L�T�N�����C�����C�g�A�b�v,,,,,,,���炫�n�߁`�U��n�߂܂�,2024-04-01,2024-04-15,18:30,21:00,,,,,,�n������쉈�́u�n�����肳���烉�C���v�ɍ����炫�����A��ɂ͈ꕔ���C�g�A�b�v����A�����Ȗ���X�������邱�Ƃ��ł�B ,,,,,,,,,,,,,�n������͔Ȉ������������炠�����c�t���t��,,,,�R�`���R�`�s�����쒬,,,,,,38.247615,140.359041,,,,,,,,,,,,,,,,,,,,,,,,,,,,,
062014,,,,�X�v�����O�t�F�X�e�B�o��,JA,,,�X�v�����O�t�F�X�e�B�o��,,,,,,,���N5��5��,2024-05-05,2024-05-05,10:00,15:45,,,,,,�������E�{���̂ق��ƂȂ�ʂ�ɁA�͂����ԁA���t�g�ԁA���o�C�Ȃǖ�30��̂͂��炭�Ԃ������낢����B,,,,,,,,,,,,,�R�`�s�������E�{���E�\����,,,,�R�`���R�`�s�������E�{���E�\����,,,,,,38.252071,140.3384647,,,,,,,,,,,,,,,,,,,,,,,,,,,,,
062014,,,,��t�ՐA�؎s,JA,,,���N�V�}�c���E�G�L�C�`,,,,,,,���N5��8���`5��10��,2024-05-08,2024-05-10,09:00,21:00,,,,,,��t�Ղ͎R�`�s�̖�t���ɂ��鍑������t���̍՗�ŁA���{�O��A�؎s�̈�ƌĂ΂��A�؎s���s����B,,,,,,,,,,,,,��t�����Ǝ��Ӗ�3�L���̒ʂ�,,,,�R�`���R�`�s��t��2-8-88,,,,,,38.261133,140.346554,,,,,,,,,,,,,,,,,,,,,,,,,,,,,
062014,,,,�ނ炫���킠�������Ղ�,JA,,,�����L�U���A�W�T�C�}�c��,,,,,,,���N6�����{�`7�����{,,,,,,,,,,"�o�����ꓰ�Q���i��515���[�g���j�ɖ�40��ށA2,500���̂����������y���ނ��Ƃ��ł���B",,,,,,,,,,,,,�ǌ����o�����ꓰ,,,,�R�`���R�`�s�厚���ؑ�6048,,,,,,38.253192,140.24313,,,,,,,,,,,,,,,,,,,,,,,,,,,,,
062014,,,,�R�`�g�Ԃ܂�,JA,,,���}�K�^�x�j�o�i�}�c��,,,,,,,���N7����{,,,,,,,,,,�g�Ԃ̃v���[���g�⑦���A�ʐ^�B�e��A��n�̌��ȂǁA�l�X�ȃC�x���g���s����B,,,,,,,,,,,,,�����g�Ԃӂꂠ���Z���^�[,,,,�R�`���R�`�s�����R1360,,,,,,38.292184,140.402865,,,,,,,,,,,,,,,,,,,,,,,,,,,,,
062014,,,,���R���C�g�A�b�v,JA,,,�z�E�W���T�����C�g�A�b�v,,,,,,,���N7�����{�`8�����{,,,,,,,,,,���R���Ύ��ܑ哰�E�J�R�������C�g�A�b�v�B,,,,,,,,,,,,,���Ύ��E��O��,,,,�R�`���R�`�s�厚�R��,,,,,,38.31098,140.435409,,,,,,,,,,,,,,,,,,,,,,,,,,,,,
062014,,,,�Ԋ}�T�}�[�t�F�X�e�B�o��,JA,,,�n�i�K�T�T�}�[�t�F�X�e�B�o��,,,,,,,���N8��4��,2024-08-04,2024-08-04,,,,,,,,�R�`�Ԋ}�܂���؂₩�ɐ���グ�邽�߁A�Ԋ}�p���[�h�̍s�Ȃ���R�[�X�����ɂ��āA���X�X�Q���̉Ԋ}�T�}�[�t�F�X�e�B�o�����J�Â����B,,,,,,,,,,,,,�R�`�s�������E�{���E�\����,,,,�R�`���R�`�s�������E�{���E�\����,,,,,,38.252071,140.3384647,,,,,,,,,,,,,,,,,,,,,,,,,,,,,
062014,,,,�R�`���ό����Y�s,JA,,,���}�K�^�P���J���R�E�u�b�T���C�`,,,,,,,���N8��4��,2024-08-04,2024-08-04,,,,,,,,�R�`�Ԋ}�܂���؂₩�ɐ���グ�邽�߁A�Ԋ}�p���[�h�̍s�Ȃ���R�[�X�����ɂ��āA�����s�����̓��Y�i���ꓰ�ɏW�߂��R�`���ό����Y�s���J�Â����B ,,,,,,,,,,,,,�R�`�s�������E�{���E�\����,,,,�R�`���R�`�s�������E�{���E�\����,,,,,,38.252071,140.3384647,,,,,,,,,,,,,,,,,,,,,,,,,,,,,
062014,,,,�R�`�Ԋ}�܂�,JA,,,���}�K�^�n�i�K�T�}�c��,,,,,,,���N8��5���`8��7��,2024-08-05,2024-08-07,18:00,21:45,,,,,,�g�Ԃ�����������}����ɁA�x��肽�����p���[�h�s�Ȃ��A�R�`�̉Ă��ʂ�ؗ�Ȃ��Ղ�B,,,,,,,,,,,,,�R�`�s�� �{���E�������ʂ�`���Ċ�,,,,�R�`���R�`�s�������E�{���E�\����,,,,,,,,,,,,,,,,,,,,,,,,,,,,,,,,,,,,
062014,,,,�R�`��ԉΑ��,JA,,,���}�K�^�_�C�n�i�r�^�C�J�C,,,,,,,���N8��14��,2024-08-14,2024-08-14,18:30,20:00,,,,,,�R�`�̉Ă̖���ʂ�s���Ƃ��Ďs���ɐe���܂�Ă���B,,,,,,,,,,,,,�R�`�s������ �{��͔�,,,,�R�`���R�`�s���钬,,,,,,38.255431,140.328076,,,,,,,,,,,,,,,,,,,,,,,,,,,,,
062014,,,,���{��̈��ω�t�F�X�e�B�o��,JA,,,�j�z���C�`�m�C���j�J�C�t�F�X�e�B�o��,,,,,,,9���h�V�̓��̑O��,,,09:30,,���ς��Ȃ��Ȃ莟��I��,,,,,���a�U.5m�̑��ŎR�`�����u���ρv���ϐ�������A�����������X�P�[�����܂��ɓ��{��̈��ω�B,,,,,,,,,,,,,�R�`�s�n������͐�~,,,,�R�`���R�`�s�n������,,,,,,38.253665,140.350805,,,,,,,,,,,,,,,,,,,,,,,,,,,,,
062014,,,,�X�Ȃ����킢�t�F�X�e�B�o��,JA,,,�}�`�i�J�j�M���C�t�F�X�e�B�o��,,,,,,,10�����{,,,,,,,,,,�u�H�ׂ�v�A�u����v�A�u�G��v�A�R�`�̖��͂��Ïk�����A�H�P��̊X�Ȃ��t�F�X�B,,,,,,,,,,,,,�R�`�s�������𒆐S�Ƃ������S�s�X�n,,,,�R�`���R�`�s������,,,,,,38.253921,140.339542,,,,,,,,,,,,,,,,,,,,,,,,,,,,,
062014,,,,���R���C�g�A�b�v,JA,,,�z�E�W���T�����C�g�A�b�v,,,,,,,10�����{�`11����{,,,,,,,,,,���R���Ύ��ܑ哰�E�J�R�������C�g�A�b�v�B,,,,,,,,,,,,,���Ύ��E��O��,,,,�R�`���R�`�s�厚�R��,,,,,,38.31098,140.435409,,,,,,,,,,,,,,,,,,,,,,,,,,,,,
062014,,,,�R�`�s���s,JA,,,���}�K�^�V�n�c�C�`,,,,,,,���N1��10��,2024-01-10,2024-01-10,10:00,17:00,,,,,,�]�ˎ��㏉�����瑱���`���s���ŁA���Ƃ̊����ے����Ắu���ԁv�A������\���u���Ђ��v�Ȃǂ̖�؁A�����߁A�c�q�؂̉��N����A�P�A�n�A�܂ȔȂǂ̖؍H�i�A�ƒ�p�i�Ȃǂ̘I�X���������ԁB,,,,,,,,,,,,,�R�`�s�������E�{���E�\����,,,,�R�`���R�`�s�������E�{���E�\����,,,,,,38.252071,140.3384647,,,,,,,,,,,,,,,,,,,,,,,,,,,,,
062014,,,,���X���C�g�A�b�v,JA,,,�W���q���E���C�g�A�b�v,,,,,,,12�����{~2�����{,2023-12-23,2024-02-25,,,���Ԓ����v36���ԊJ��,,,,,���E�Ɍւ�u�����̎��X�v�����C�g�A�b�v�B,,,,,,,,,,,,,�������[�v�E�F�C�n���R���w����,,,,�R�`���R�`�s��������229-3,,,,,,38.161674,140.39512,,,,,,,,,,,,,,,,,,,,,,,,,,,,,
062014,,,,�������X�܂�,JA,,,�U�I�E�W���q���E�}�c��,,,,,,,12�����{~2�����{,2023-12-23,2024-02-25,,,,,,,,���E�Ɍւ鑠���̎��X�E��������X�L�[��𑶕��Ɋy���߂�C�x���g�����ځB,,,,,,,,,,,,,��������X�L�[��,,,,�R�`���R�`�s��������,,,,,,38.166551,140.395239,,,,,,,,,,,,,,,,,,,,,,,,,,,,,
